BDBM125582 US8772316, 65::US9670181, 65 4-(dibenzo[b,d]furan-2-ylmethyl)-6,7-dimethoxy-1-propylisoquinolin-3-amine
SMILES CCCc1nc(N)c(Cc2ccc3oc4ccccc4c3c2)c2cc(OC)c(OC)cc12
InChI Key InChIKey=QONCEKZSHONPPB-UHFFFAOYSA-N
Data  2 IC50
  Tab Delimited (TSV)   2D SDfile   Computed 3D by Vconf -m prep SDfile
Find this compound or compounds like it in BindingDB:
Activity Spreadsheet -- Enzyme Inhibition Constant Data from BindingDB
Found 2 hits for monomerid = 125582
TargetcAMP and cAMP-inhibited cGMP 3',5'-cyclic phosphodiesterase 10A(Homo sapiens (Human))
Allergan
US Patent
LigandPNGBDBM125582(US8772316, 65 | US9670181, 65 4-(dibenzo[b,d]furan...)
Affinity DataIC50:  967nMpH: 7.4 T: 2°C. Assay description: The PDE assay is based on the homogenous time-resolved fluorescence resonance energy transfer (TR-FRET) technology (LANCE® from Perkin Elmer). This c...
In DepthDetails US Patent
TargetcAMP and cAMP-inhibited cGMP 3',5'-cyclic phosphodiesterase 10A(Homo sapiens (Human))
Allergan
US Patent
LigandPNGBDBM125582(US8772316, 65 | US9670181, 65 4-(dibenzo[b,d]furan...)
Affinity DataIC50:  967nMpH: 7.4Assay Description:The PDE assay is based on the homogenous time-resolved fluorescence resonance energy transfer (TR-FRET) technology (LANCE from Perkin Elmer). This co...
In DepthDetails US Patent