BDBM125676 US8772305, 71
SMILES CN1CCN(CC1)C(=O)c1cc2cc(Nc3nccc(n3)-c3cc(OCC(C)(C)CO)ccn3)ccc2[nH]1
InChI Key InChIKey=CVHRNCJEGZDRJA-UHFFFAOYSA-N
Data  1 IC50
  Tab Delimited (TSV)   2D SDfile   Computed 3D by Vconf -m prep SDfile
Find this compound or compounds like it in BindingDB:
Activity Spreadsheet -- Enzyme Inhibition Constant Data from BindingDB
Found 1 hit for monomerid = 125676
TargetTyrosine-protein kinase SYK(Homo sapiens (Human))
Boehringer Ingelheim International
US Patent
LigandPNGBDBM125676(US8772305, 71)
Affinity DataIC50:  0.900nMpH: 7.5 T: 2°C. Assay description: Recombinant human Syk (amino acids 342-635) was expressed as a fusion protein with an N-terminal GST tag, affinity-purified and deep-frozen at a conc...
In DepthDetails US Patent