BDBM12585 (2R,3S)-3-amino-2-hydroxy-N-(naphthalen-2-yl)-4-phenylbutane-1-sulfonamido::N-[(2R,3S)-3-AMINO-2-HYDROXY-4-PHENYLBUTYL]NAPHTHALENE-2-SULFONAMIDE::Sulfonamide Compound 3
SMILES N[C@@H](Cc1ccccc1)[C@H](O)CNS(=O)(=O)c1ccc2ccccc2c1
InChI Key InChIKey=QSSWSEQPKCCATQ-VQTJNVASSA-N
Data  1 IC50
PDB links: 1 PDB ID matches this monomer.
  Tab Delimited (TSV)   2D SDfile   Computed 3D by Vconf -m prep SDfile
Find this compound or compounds like it in BindingDB:
Activity Spreadsheet -- Enzyme Inhibition Constant Data from BindingDB
Found 1 hit for monomerid = 12585
TargetProthrombin(Homo sapiens (Human))
Astex
LigandPNGBDBM12585((2R,3S)-3-amino-2-hydroxy-N-(naphthalen-2-yl)-4-ph...)
Affinity DataIC50:  1.00E+5nMpH: 8.0 T: 2°C. Assay description: The cleavage of the substrate was followed by monitoring the change in fluorescence at 460 nm (excitation at 365 nm) for 25 min at room temperature o...