BDBM12618 2,4-Diamino-5-ketopyrimidine 36::5-[(5-chloro-2-methoxyphenyl)carbonyl]-2-N-(1-methanesulfonylpiperidin-4-yl)pyrimidine-2,4-diamine::[4-Amino-2-(1-methanesulfonylpiperidin-4-ylamino)pyrimidin-5-yl](5-chloro-2-methoxyphenyl)methanone
SMILES COc1ccc(Cl)cc1C(=O)c1cnc(NC2CCN(CC2)S(C)(=O)=O)nc1N
InChI Key InChIKey=HQLDCZOAPRTUGV-UHFFFAOYSA-N
Data  3 KI
  Tab Delimited (TSV)   2D SDfile   Computed 3D by Vconf -m prep SDfile
Find this compound or compounds like it in BindingDB:
Activity Spreadsheet -- Enzyme Inhibition Constant Data from BindingDB
Found 3 hits for monomerid = 12618
TargetCyclin-dependent kinase 4/G1/S-specific cyclin-D1(Homo sapiens (Human))
Hoffmann-La Roche
LigandPNGBDBM12618(2,4-Diamino-5-ketopyrimidine 36 | 5-[(5-chloro-2-m...)
Affinity DataKi:  36nM. Assay description: Enzymes were assayed with retinoblastoma substrate in 384-well plates containing diluted test compounds. Final ATP concentration was 3x the respectiv...
In DepthDetails ArticlePubMed
TargetCyclin-dependent kinase/G2/mitotic-specific cyclin- 1(Homo sapiens (Human))
Hoffmann-La Roche
LigandPNGBDBM12618(2,4-Diamino-5-ketopyrimidine 36 | 5-[(5-chloro-2-m...)
Affinity DataKi:  133nM. Assay description: Enzymes were assayed with retinoblastoma substrate in 384-well plates containing diluted test compounds. Final ATP concentration was 3x the respectiv...
In DepthDetails ArticlePubMed
TargetCyclin-dependent kinase 2/G1/S-specific cyclin-E1(Homo sapiens (Human))
Hoffmann-La Roche
LigandPNGBDBM12618(2,4-Diamino-5-ketopyrimidine 36 | 5-[(5-chloro-2-m...)
Affinity DataKi:  451nM. Assay description: Enzymes were assayed with retinoblastoma substrate in 384-well plates containing diluted test compounds. Final ATP concentration was 3x the respectiv...
In DepthDetails ArticlePubMed