BDBM126188 US8778957, 184
SMILES CC(C)[C@H]1CN(C)CCN1Cc1ccc2cc3CC4(Cc3cc2n1)C(C)C(=O)NC4=O
InChI Key InChIKey=JFQVNOLOYOZRPO-PMBLGMBLSA-N
Data  1 KI
  Tab Delimited (TSV)   2D SDfile   Computed 3D by Vconf -m prep SDfile
Find this compound or compounds like it in BindingDB:
Activity Spreadsheet -- Enzyme Inhibition Constant Data from BindingDB
Found 1 hit for monomerid = 126188
TargetCalcitonin gene-related peptide 1(Homo sapiens (Human))
Merck Sharp & Dohme
US Patent
LigandPNGBDBM126188(US8778957, 184)
Affinity DataKi:  1.70E+3nM ΔG°:  -7.87kcal/molepH: 7.4 T: 2°C. Assay description: Cells expressing recombinant human CL receptor/RAMP1 were washed with PBS and harvested in harvest buffer containing 50 mM HEPES, 1 mM EDTA and Compl...
In DepthDetails US Patent