BDBM126649 US8785638, 133
SMILES CCCC(C(O)=O)c1c(C)nc2sc3COCCc3c2c1-c1ccc(C)cc1
InChI Key InChIKey=PBYAKPGPMNGXBR-UHFFFAOYSA-N
Data  1 IC50
  Tab Delimited (TSV)   2D SDfile   Computed 3D by Vconf -m prep SDfile
Find this compound or compounds like it in BindingDB:
Activity Spreadsheet -- Enzyme Inhibition Constant Data from BindingDB
Found 1 hit for monomerid = 126649
TargetGag-Pol polyprotein(Human immunodeficiency virus type 1 (HIV-1))
Katholieke Universiteit Leuven
US Patent
LigandPNGBDBM126649(US8785638, 133)
Affinity DataIC50:  7.80E+3nMpH: 7.4 T: 2°C. Assay description: The AlphaScreen assay was performed according to the manufacturer's protocol (Perkin Elmer, Benelux). Reactions were performed in 25 ul final volume ...
In DepthDetails US Patent