BDBM126789 US8785489, ethyl 5-(2-{[(6-oxo-1,6-dihydropyridin-3-yl)methyl]carbamoyl}pyridin-4-yl)-1H-indole-2-carboxylate
SMILES CCOC(=O)c1cc2cc(ccc2[nH]1)-c1ccnc(c1)C(=O)NCc1ccc(=O)[nH]c1
InChI Key InChIKey=ATHJZADWADIPIE-UHFFFAOYSA-N
Data  1 IC50
  Tab Delimited (TSV)   2D SDfile   Computed 3D by Vconf -m prep SDfile
Find this compound or compounds like it in BindingDB:
Activity Spreadsheet -- Enzyme Inhibition Constant Data from BindingDB
Found 1 hit for monomerid = 126789
TargetCollagenase 3(Mus musculus (Mouse))
Boehringer Ingelheim International
US Patent
LigandPNGBDBM126789(US8785489, ethyl 5-(2-{[(6-oxo-1,6-dihydropyridin-...)
Affinity DataIC50:  35nM. Assay description: The EnzoLyte 520 Generic MMP Assay Kit (AnaSpec Inc.) can detect the activity of several MMPs including MMP-1, 2, 3, 7, 8, 9, 13, and 14. This kit us...
In DepthDetails US Patent