BDBM12684 1-(3-amino-1,2-benzoxazol-5-yl)-7-(4-{2-[(dimethylamino)methyl]phenyl}-2-fluorophenyl)-3-(trifluoromethyl)-1H,4H,5H,6H,7H,8H-pyrazolo[3,4-c]azepin-8-one::BMS-740808 Analogue 16b::bicyclic pyrazole scaffold
SMILES CN(C)Cc1ccccc1-c1ccc(N2CCCc3c(nn(c3C2=O)-c2ccc3onc(N)c3c2)C(F)(F)F)c(F)c1
InChI Key InChIKey=SFHOYYLXQXCOQP-UHFFFAOYSA-N
Data  1 KI
  Tab Delimited (TSV)   2D SDfile   Computed 3D by Vconf -m prep SDfile
Find this compound or compounds like it in BindingDB:
Activity Spreadsheet -- Enzyme Inhibition Constant Data from BindingDB
Found 1 hit for monomerid = 12684
TargetCoagulation factor X(Homo sapiens (Human))
Bristol-Myers Squibb Pharmaceutical Research Institute
LigandPNGBDBM12684(1-(3-amino-1,2-benzoxazol-5-yl)-7-(4-{2-[(dimethyl...)
Affinity DataKi:  0.850nM ΔG°:  -12.2kcal/molepH: 7.0 T: 2°C. Assay description: Ki values were obtained from human purified enzyme. All assays were run in microtiter plates. Plates were read for 30 min at 405 nm. Rates were deter...
In DepthDetails ArticlePubMed