BDBM126845 US8785464, 4
SMILES COc1cc(C(=O)NC2CCN(C)CC2)c(F)cc1Nc1ncc(c(Oc2ccccc2)n1)C(F)(F)F
InChI Key InChIKey=CCEJPJMKRNUWMZ-UHFFFAOYSA-N
Data  1 IC50
  Tab Delimited (TSV)   2D SDfile   Computed 3D by Vconf -m prep SDfile
Find this compound or compounds like it in BindingDB:
Activity Spreadsheet -- Enzyme Inhibition Constant Data from BindingDB
Found 1 hit for monomerid = 126845
TargetFocal adhesion kinase 1(Homo sapiens (Human))
Boehringer Ingelheim International
US Patent
LigandPNGBDBM126845(US8785464, 4)
Affinity DataIC50:  48nMpH: 7.5Assay Description:This test uses active PTK2 enzyme (Invitrogen Code PV3832) and poly-Glu-Tyr (4:1, Sigma P-0275) as the kinase substrate. The kinase activity is detec...
In DepthDetails US Patent