BDBM126884 US8785464, 43
SMILES COc1cc(ccc1Nc1ncc(c(Oc2cccc(F)c2C#N)n1)C(F)(F)F)C(=O)NC1CCN(C)CC1
InChI Key InChIKey=FYLYHBWFNYFXQV-UHFFFAOYSA-N
Data  1 IC50
  Tab Delimited (TSV)   2D SDfile   Computed 3D by Vconf -m prep SDfile
Find this compound or compounds like it in BindingDB:
Activity Spreadsheet -- Enzyme Inhibition Constant Data from BindingDB
Found 1 hit for monomerid = 126884
TargetFocal adhesion kinase 1(Homo sapiens (Human))
Boehringer Ingelheim International
US Patent
LigandPNGBDBM126884(US8785464, 43)
Affinity DataIC50:  31nMpH: 7.5Assay Description:This test uses active PTK2 enzyme (Invitrogen Code PV3832) and poly-Glu-Tyr (4:1, Sigma P-0275) as the kinase substrate. The kinase activity is detec...
In DepthDetails US Patent