BDBM126983 US8785459, 58
SMILES COc1cc(ccc1O)-c1ccc2ncnc(Nc3cc(O)ccc3F)c2c1
InChI Key InChIKey=GQDIEXXTSJEMLK-UHFFFAOYSA-N
Data  3 IC50
  Tab Delimited (TSV)   2D SDfile   Computed 3D by Vconf -m prep SDfile
Find this compound or compounds like it in BindingDB:
Activity Spreadsheet -- Enzyme Inhibition Constant Data from BindingDB
Found 3 hits for monomerid = 126983
TargetSerine/threonine-protein kinase B-raf(Homo sapiens (Human))
Development Center For Biotechnology
US Patent
LigandPNGBDBM126983(US8785459, 58)
Affinity DataIC50:  16.1nM. Assay description: Inhibition of kinase activity by test compound disclosed herein was estimated by quantifying the amount of [33P] incorporation of substrate in the pr...
In DepthDetails US Patent
TargetRAF proto-oncogene serine/threonine-protein kinase(Homo sapiens (Human))
Development Center For Biotechnology
US Patent
LigandPNGBDBM126983(US8785459, 58)
Affinity DataIC50:  170nM. Assay description: Inhibition of kinase activity by test compound disclosed herein was estimated by quantifying the amount of [33P] incorporation of substrate in the pr...
In DepthDetails US Patent
TargetSerine/threonine-protein kinase B-raf [V600E](Homo sapiens (Human))
Development Center For Biotechnology
US Patent
LigandPNGBDBM126983(US8785459, 58)
Affinity DataIC50:  23.2nM. Assay description: Inhibition of kinase activity by test compound disclosed herein was estimated by quantifying the amount of [33P] incorporation of substrate in the pr...
In DepthDetails US Patent