BDBM12728 1-(4-methoxyphenyl)-4-methyl-6-{4-[2-(pyrrolidin-1-ylmethyl)phenyl]phenyl}-3-(trifluoromethyl)-1H,6H,7H-pyrazolo[3,4-d]pyridazin-7-one::pyrazolo[3,4-d]pyridazinone 46
SMILES COc1ccc(cc1)-n1nc(c2c(C)nn(-c3ccc(cc3)-c3ccccc3CN3CCCC3)c(=O)c12)C(F)(F)F
InChI Key InChIKey=QEXUYNKXWDDROG-UHFFFAOYSA-N
Data  1 KI
  Tab Delimited (TSV)   2D SDfile   Computed 3D by Vconf -m prep SDfile
Find this compound or compounds like it in BindingDB:
Activity Spreadsheet -- Enzyme Inhibition Constant Data from BindingDB
Found 1 hit for monomerid = 12728
TargetCoagulation factor X(Homo sapiens (Human))
Bristol-Myers Squibb
LigandPNGBDBM12728(1-(4-methoxyphenyl)-4-methyl-6-{4-[2-(pyrrolidin-1...)
Affinity DataKi:  2.80nM. Assay description: Ki values were obtained from human purified enzyme. All assays were run in microtiter plates. Plates were read for 30 min at 405 nm. Rates were deter...
In DepthDetails ArticlePubMed