BDBM12736 N-{3-[6-(4-{2-[(dimethylamino)methyl]phenyl}phenyl)-7-oxo-3-(trifluoromethyl)-1H,4H,5H,6H,7H-pyrazolo[3,4-c]pyridin-1-yl]phenyl}acetamide::dihydropyrazolopyridinone analogue 6g
SMILES CN(C)Cc1ccccc1-c1ccc(cc1)N1CCc2c(nn(c2C1=O)-c1cccc(NC(C)=O)c1)C(F)(F)F
InChI Key InChIKey=LSNYUMCSNUIESQ-UHFFFAOYSA-N
Data  1 KI
  Tab Delimited (TSV)   2D SDfile   Computed 3D by Vconf -m prep SDfile
Find this compound or compounds like it in BindingDB:
Activity Spreadsheet -- Enzyme Inhibition Constant Data from BindingDB
Found 1 hit for monomerid = 12736
TargetCoagulation factor X(Homo sapiens (Human))
Bristol-Myers Squibb Pharmaceutical Research Institute
LigandPNGBDBM12736(N-{3-[6-(4-{2-[(dimethylamino)methyl]phenyl}phenyl...)
Affinity DataKi:  88nM ΔG°:  -9.52kcal/molepH: 7.0 T: 2°C. Assay description: Ki values were obtained from human purified enzyme. All assays were run in microtiter plates. Plates were read for 30 min at 405 nm. Rates were deter...
In DepthDetails ArticlePubMed