BDBM127376 US8791131, 138
SMILES COc1ccc(cn1)-c1ccc2ncc3n(C)c(=O)n(C4CCN(CC4)C(=O)CN(C)C)c3c2n1
InChI Key InChIKey=ABXIVYJPASFGEB-UHFFFAOYSA-N
Data  2 KI
  Tab Delimited (TSV)   2D SDfile   Computed 3D by Vconf -m prep SDfile
Find this compound or compounds like it in BindingDB:
Activity Spreadsheet -- Enzyme Inhibition Constant Data from BindingDB
Found 2 hits for monomerid = 127376
LigandPNGBDBM127376(US8791131, 138)
Affinity DataKi:  2.23nM ΔG°:  -11.8kcal/molepH: 7.4 T: 2°C. Assay description: Compounds of the present invention were evaluated for potency against PI3-Kalpha using an in vitro kinase assay. PI3-Kalpha activity is measured in v...
In DepthDetails US Patent
TargetSerine/threonine-protein kinase mTOR(Homo sapiens (Human))
Pfizer
US Patent
LigandPNGBDBM127376(US8791131, 138)
Affinity DataKi:  10.6nM ΔG°:  -10.9kcal/molepH: 7.5 T: 2°C. Assay description: Compounds of the present invention were evaluated for potency against mTOR using an in vitro kinase assay. mTOR activity is measured in vitro by dete...
In DepthDetails US Patent