BDBM127456 US11547697, Compound 202::US9682141, 202
SMILES Nc1nc2cc(ccc2o1)-c1ccc2ncc(C(=O)N3CCC(O)C3)n2c1
InChI Key InChIKey=OBORBDRLUWEHCP-UHFFFAOYSA-N
Data  7 IC50
  Tab Delimited (TSV)   2D SDfile   Computed 3D by Vconf -m prep SDfile
Find this compound or compounds like it in BindingDB:
Activity Spreadsheet -- Enzyme Inhibition Constant Data from BindingDB
Found 7 hits for monomerid = 127456
TargetPhosphatidylinositol 3-kinase regulatory subunit alpha(Homo sapiens (Human))
Intellikine
US Patent
LigandPNGBDBM127456(US11547697, Compound 202 | US9682141, 202)
Affinity DataIC50: <100nMT: 2°C. Assay description: Briefly, the assay is a time resolved FRET assay that indirectly measures PIP3 product formed by the activity of a PI3-K. The kinase reaction is perf...
Ligand InfoPC cidPC sid
In DepthDetails US Patent
TargetPhosphatidylinositol 3-kinase regulatory subunit beta(Homo sapiens (Human))
Intellikine
US Patent
LigandPNGBDBM127456(US11547697, Compound 202 | US9682141, 202)
Affinity DataIC50: <1.00E+4nMT: 2°C. Assay description: Briefly, the assay is a time resolved FRET assay that indirectly measures PIP3 product formed by the activity of a PI3-K. The kinase reaction is perf...
Ligand InfoPC cidPC sid
In DepthDetails US Patent
LigandPNGBDBM127456(US11547697, Compound 202 | US9682141, 202)
Affinity DataIC50: <1.00E+4nMT: 2°C. Assay description: Briefly, the assay is a time resolved FRET assay that indirectly measures PIP3 product formed by the activity of a PI3-K. The kinase reaction is perf...
Ligand InfoPC cidPC sid
In DepthDetails US Patent
TargetPhosphatidylinositol 4,5-bisphosphate 3-kinase catalytic subunit gamma isoform(Homo sapiens (Human))
Millennium Pharmaceuticals
US Patent
LigandPNGBDBM127456(US11547697, Compound 202 | US9682141, 202)
Affinity DataIC50: <1.00E+3nM. Assay description: An exemplary system is PI 3-Kinase (human) HTRF? Assay from Upstate. The assay can be carried out according to the procedures suggested by the manufa...
Ligand InfoPC cidPC sid
In DepthDetails US Patent
TargetPhosphatidylinositol 4,5-bisphosphate 3-kinase catalytic subunit beta isoform(Homo sapiens (Human))
Millennium Pharmaceuticals
US Patent
LigandPNGBDBM127456(US11547697, Compound 202 | US9682141, 202)
Affinity DataIC50: <1.00E+4nM. Assay description: An exemplary system is PI 3-Kinase (human) HTRF? Assay from Upstate. The assay can be carried out according to the procedures suggested by the manufa...
Ligand InfoPC cidPC sid
In DepthDetails US Patent
LigandPNGBDBM127456(US11547697, Compound 202 | US9682141, 202)
Affinity DataIC50: <1.00E+4nM. Assay description: An exemplary system is PI 3-Kinase (human) HTRF? Assay from Upstate. The assay can be carried out according to the procedures suggested by the manufa...
Ligand InfoPC cidPC sid
In DepthDetails US Patent
TargetPhosphatidylinositol 4,5-bisphosphate 3-kinase catalytic subunit alpha isoform(Homo sapiens (Human))
Millennium Pharmaceuticals
US Patent
LigandPNGBDBM127456(US11547697, Compound 202 | US9682141, 202)
Affinity DataIC50: <100nM. Assay description: An exemplary system is PI 3-Kinase (human) HTRF? Assay from Upstate. The assay can be carried out according to the procedures suggested by the manufa...
Ligand InfoPC cidPC sid
In DepthDetails US Patent