BDBM127600 US8791118, 163
SMILES FC(F)Cn1cc(cn1)-c1cnc2ccc(NC(=O)NCCCCc3ccccc3)nc2n1
InChI Key InChIKey=SLFNZIYIXQVRDI-UHFFFAOYSA-N
Data  1 IC50
  Tab Delimited (TSV)   2D SDfile   Computed 3D by Vconf -m prep SDfile
Find this compound or compounds like it in BindingDB:
Activity Spreadsheet -- Enzyme Inhibition Constant Data from BindingDB
Found 1 hit for monomerid = 127600
TargetMitogen-activated protein kinase 1(Homo sapiens (Human))
Aeterna Zentaris
US Patent
LigandPNGBDBM127600(US8791118, 163)
Affinity DataIC50:  2nMpH: 7.5Assay Description:The inhibitory effect of the compounds according to the invention was tested on various serine/threonine, tyrosine and lipid kinases in enzymatic ass...
In DepthDetails US Patent