BDBM127609 US8791118, 172
SMILES O=C(NCCCCc1ccccc1)Nc1ccc2ncc(nc2n1)N1CCCC1
InChI Key InChIKey=ZZWRWYBPGWAMFH-UHFFFAOYSA-N
Data  1 IC50
  Tab Delimited (TSV)   2D SDfile   Computed 3D by Vconf -m prep SDfile
Find this compound or compounds like it in BindingDB:
Activity Spreadsheet -- Enzyme Inhibition Constant Data from BindingDB
Found 1 hit for monomerid = 127609
TargetMitogen-activated protein kinase 1(Homo sapiens (Human))
Aeterna Zentaris
US Patent
LigandPNGBDBM127609(US8791118, 172)
Affinity DataIC50:  5nMpH: 7.5Assay Description:The inhibitory effect of the compounds according to the invention was tested on various serine/threonine, tyrosine and lipid kinases in enzymatic ass...
In DepthDetails US Patent