BDBM127911 US8791130, 41
SMILES CNc1nc(Nc2cc(F)c(cc2OC)-c2cnn(C)c2C(=O)N(C)C)ncc1C(F)(F)F
InChI Key InChIKey=BAHQXHISOYROOR-UHFFFAOYSA-N
Data  1 KI
  Tab Delimited (TSV)   2D SDfile   Computed 3D by Vconf -m prep SDfile
Find this compound or compounds like it in BindingDB:
Activity Spreadsheet -- Enzyme Inhibition Constant Data from BindingDB
Found 1 hit for monomerid = 127911
TargetLeucine-rich repeat serine/threonine-protein kinase 2(Homo sapiens (Human))
Genentech
US Patent
LigandPNGBDBM127911(US8791130, 41)
Affinity DataKi:  1nM. Assay description: This assay was used to determine a compound's potency in inhibiting activity of LRRK2 by determining, Kiapp, IC50, or percent inhibition values. ...
Ligand InfoPC cidPC sid
In DepthDetails US Patent