BDBM127941 US8796310, 1D
SMILES Cc1cc(Nc2cc(ccn2)N2CCNCC2)nc(c1)-c1cnc(s1)C1(O)CCCc2cc(ccc12)C(O)=O
InChI Key InChIKey=PANGETTYTUWTFZ-UHFFFAOYSA-N
Data  1 IC50
  Tab Delimited (TSV)   2D SDfile   Computed 3D by Vconf -m prep SDfile
Find this compound or compounds like it in BindingDB:
Activity Spreadsheet -- Enzyme Inhibition Constant Data from BindingDB
Found 1 hit for monomerid = 127941
TargetTyrosine-protein kinase SYK(Homo sapiens (Human))
Merck Sharp & Dohme
US Patent
LigandPNGBDBM127941(US8796310, 1D)
Affinity DataIC50: <0.5nMpH: 7.5Assay Description:A recombinant GST-hSyk fusion protein was used to measure potency of compounds to inhibit human Syk activity. The recombinant human GST-Syk (Cama Bio...
In DepthDetails US Patent