BDBM128068 US8796330, 87
SMILES ONC(=O)\C=C\c1ccc(NS(=O)(=O)c2cccs2)cc1
InChI Key InChIKey=NUGUKNLWEMUADP-VMPITWQZSA-N
Data  1 IC50
  Tab Delimited (TSV)   2D SDfile   Computed 3D by Vconf -m prep SDfile
Find this compound or compounds like it in BindingDB:
Activity Spreadsheet -- Enzyme Inhibition Constant Data from BindingDB
Found 1 hit for monomerid = 128068
TargetHistone deacetylase 1(Homo sapiens (Human))
Methylgene
US Patent
LigandPNGBDBM128068(US8796330, 87)
Affinity DataIC50:  600nMT: 2°C. Assay description: For deacetylase assays, 20,000 cpm of the [3H]-metabolically labeled acetylated histone substrate (M. Yoshida et al., J. Biol. Chem. 265(28): 17174-1...
Ligand InfoPC cidPC sid
In DepthDetails US Patent