BDBM128135 5-(4-Bromo-phenyl)-4-phenyl-4H-[1,2,4]triazole-3-thiol anion::MLS001208100::SMR000515021::cid_23724341::zinc;5-(4-bromophenyl)-4-phenyl-1,2,4-triazole-3-thiolate
SMILES [Zn++].[S-]c1nnc(-c2ccc(Br)cc2)n1-c1ccccc1
InChI Key InChIKey=JHHGOTJZFNPUQM-UHFFFAOYSA-M
Data  1 IC50
  Tab Delimited (TSV)   2D SDfile   Computed 3D by Vconf -m prep SDfile
Find this compound or compounds like it in BindingDB:
Activity Spreadsheet -- Enzyme Inhibition Constant Data from BindingDB
Found 1 hit for monomerid = 128135
TargetRNA-editing ligase 1, mitochondrial(Trypanosoma brucei brucei)
The Scripps Research Institute Molecular Screening Center
Curated by PubChem BioAssay
LigandPNGBDBM128135(5-(4-Bromo-phenyl)-4-phenyl-4H-[1,2,4]triazole-3-t...)
Affinity DataIC50:  2.02E+4nM. Assay description: Source (MLPCN Center Name): The Scripps Research Institute Molecular Screening Center (SRIMSC) Center Affiliation: The Scripps Research Institute Ass...
Ligand InfoPC cidPC sid
In DepthDetails PCBioAssay