BDBM128140 MLS001239292::N-[3-(dimethylamino)propyl]-4-[ethyl(phenyl)sulfamoyl]-N-(4-methyl-1,3-benzothiazol-2-yl)benzamide;hydrochloride::SMR000807813::cid_24891949
SMILES Cl.CCN(c1ccccc1)S(=O)(=O)c1ccc(cc1)C(=O)N(CCCN(C)C)c1nc2c(C)cccc2s1
InChI Key InChIKey=JDXRCVGZRHCTJB-UHFFFAOYSA-N
Data  1 IC50
  Tab Delimited (TSV)   2D SDfile   Computed 3D by Vconf -m prep SDfile
Find this compound or compounds like it in BindingDB:
Activity Spreadsheet -- Enzyme Inhibition Constant Data from BindingDB
Found 1 hit for monomerid = 128140
TargetRNA-editing ligase 1, mitochondrial(Trypanosoma brucei brucei)
The Scripps Research Institute Molecular Screening Center
Curated by PubChem BioAssay
LigandPNGBDBM128140(MLS001239292 | N-[3-(dimethylamino)propyl]-4-[ethy...)
Affinity DataIC50: >9.66E+4nM. Assay description: Source (MLPCN Center Name): The Scripps Research Institute Molecular Screening Center (SRIMSC) Center Affiliation: The Scripps Research Institute Ass...
In DepthDetails PCBioAssay