BDBM128160 6-methyl-1-[4-(trifluoromethyl)benzyl]-2-[[2-(trifluoromethyl)benzyl]amino]-4-[2-(trifluoromethyl)phenyl]-4H-pyrimidine-5-carboxylic acid methyl ester::6-methyl-4-[2-(trifluoromethyl)phenyl]-1-[[4-(trifluoromethyl)phenyl]methyl]-2-[[2-(trifluoromethyl)phenyl]methylamino]-4H-pyrimidine-5-carboxylic acid methyl ester::MLS003843149::SMR002515862::cid_53316251::methyl 6-methyl-4-[2-(trifluoromethyl)phenyl]-1-[[4-(trifluoromethyl)phenyl]methyl]-2-[[2-(trifluoromethyl)phenyl]methylamino]-4H-pyrimidine-5-carboxylate
SMILES COC(=O)C1=C(C)N(Cc2ccc(cc2)C(F)(F)F)C(NCc2ccccc2C(F)(F)F)=NC1c1ccccc1C(F)(F)F
InChI Key InChIKey=VHUHPVKIZSVHCA-UHFFFAOYSA-N
Data  1 IC50
  Tab Delimited (TSV)   2D SDfile   Computed 3D by Vconf -m prep SDfile
Find this compound or compounds like it in BindingDB:
Activity Spreadsheet -- Enzyme Inhibition Constant Data from BindingDB
Found 1 hit for monomerid = 128160
TargetRNA-editing ligase 1, mitochondrial(Trypanosoma brucei brucei)
The Scripps Research Institute Molecular Screening Center
Curated by PubChem BioAssay
LigandPNGBDBM128160(6-methyl-1-[4-(trifluoromethyl)benzyl]-2-[[2-(trif...)
Affinity DataIC50: >9.66E+4nM. Assay description: Source (MLPCN Center Name): The Scripps Research Institute Molecular Screening Center (SRIMSC) Center Affiliation: The Scripps Research Institute Ass...
In DepthDetails PCBioAssay