BDBM128211 7-[(4-hydroxyphenyl)-[(6-methyl-2-pyridinyl)amino]methyl]-2-methyl-8-quinolinol::7-[(4-hydroxyphenyl)-[(6-methyl-2-pyridyl)amino]methyl]-2-methyl-quinolin-8-ol::7-[(4-hydroxyphenyl)-[(6-methylpyridin-2-yl)amino]methyl]-2-methyl-quinolin-8-ol::7-[(4-hydroxyphenyl)-[(6-methylpyridin-2-yl)amino]methyl]-2-methylquinolin-8-ol::7-{(4-hydroxyphenyl)[(6-methyl-2-pyridinyl)amino]methyl}-2-methyl-8-quinolinol::MLS000530643::SMR000135621::cid_2895747
SMILES Cc1cccc(NC(c2ccc(O)cc2)c2ccc3ccc(C)nc3c2O)n1
InChI Key InChIKey=GHAJWLCLZNLXNM-UHFFFAOYSA-N
Data  1 IC50  1 EC50
  Tab Delimited (TSV)   2D SDfile   Computed 3D by Vconf -m prep SDfile
Find this compound or compounds like it in BindingDB:
Activity Spreadsheet -- Enzyme Inhibition Constant Data from BindingDB
Found 2 hits for monomerid = 128211
TargetTransthyretin(Homo sapiens (Human))
The Scripps Research Institute Molecular Screening Center
Curated by PubChem BioAssay
LigandPNGBDBM128211(7-[(4-hydroxyphenyl)-[(6-methyl-2-pyridinyl)amino]...)
Affinity DataEC50: >1.67E+5nM. Assay description: Source (MLPCN Center Name): The Scripps Research Institute Molecular Screening Center (SRIMSC) Affiliation: The Scripps Research Institute, TSRI Assa...
In DepthDetails PCBioAssay
TargetTransthyretin(Homo sapiens (Human))
The Scripps Research Institute Molecular Screening Center
Curated by PubChem BioAssay
LigandPNGBDBM128211(7-[(4-hydroxyphenyl)-[(6-methyl-2-pyridinyl)amino]...)
Affinity DataIC50:  6.18E+4nM. Assay description: Source (MLPCN Center Name): The Scripps Research Institute Molecular Screening Center (SRIMSC) Affiliation: The Scripps Research Institute, TSRI Assa...
In DepthDetails PCBioAssay