BDBM128221 (1,5-dimethylpyrazol-4-yl)-indolin-1-yl-methanone::1-[(1,5-dimethyl-1H-pyrazol-4-yl)carbonyl]indoline::2,3-dihydroindol-1-yl-(1,5-dimethyl-4-pyrazolyl)methanone::2,3-dihydroindol-1-yl-(1,5-dimethylpyrazol-4-yl)methanone::MLS000698295::SMR000227824::cid_1225706
SMILES Cc1c(cnn1C)C(=O)N1CCc2ccccc12
InChI Key InChIKey=IONFENJMUKPATL-UHFFFAOYSA-N
Data  1 IC50  1 EC50
  Tab Delimited (TSV)   2D SDfile   Computed 3D by Vconf -m prep SDfile
Find this compound or compounds like it in BindingDB:
Activity Spreadsheet -- Enzyme Inhibition Constant Data from BindingDB
Found 2 hits for monomerid = 128221
TargetTransthyretin(Homo sapiens (Human))
The Scripps Research Institute Molecular Screening Center
Curated by PubChem BioAssay
LigandPNGBDBM128221((1,5-dimethylpyrazol-4-yl)-indolin-1-yl-methanone ...)
Affinity DataEC50: >1.67E+5nM. Assay description: Source (MLPCN Center Name): The Scripps Research Institute Molecular Screening Center (SRIMSC) Affiliation: The Scripps Research Institute, TSRI Assa...
Ligand InfoPC cidPC sid
In DepthDetails PCBioAssay
TargetTransthyretin(Homo sapiens (Human))
The Scripps Research Institute Molecular Screening Center
Curated by PubChem BioAssay
LigandPNGBDBM128221((1,5-dimethylpyrazol-4-yl)-indolin-1-yl-methanone ...)
Affinity DataIC50: >1.67E+5nM. Assay description: Source (MLPCN Center Name): The Scripps Research Institute Molecular Screening Center (SRIMSC) Affiliation: The Scripps Research Institute, TSRI Assa...
Ligand InfoPC cidPC sid
In DepthDetails PCBioAssay