BDBM128292 US8796293, 4
SMILES CC(C)(C)OC(=O)NC1CCN(CC1)c1ncnc2[nH]c(=O)[nH]c12
InChI Key InChIKey=IQGWUVWAQXSQDX-UHFFFAOYSA-N
Data  1 IC50
  Tab Delimited (TSV)   2D SDfile   Computed 3D by Vconf -m prep SDfile
Find this compound or compounds like it in BindingDB:
Activity Spreadsheet -- Enzyme Inhibition Constant Data from BindingDB
Found 1 hit for monomerid = 128292
TargetRho-associated protein kinase 2(Homo sapiens (Human))
The Institute Of Cancer Research
US Patent
LigandPNGBDBM128292(US8796293, 4)
Affinity DataIC50: >1.00E+3nMpH: 7.5 T: 2°C. Assay description: In a final reaction volume of 25 ul, ROCK-II (h) (5-10 mU) is incubated with 50 mM Tris pH 7.5, 0.1 mM EGTA, 30 uM KEAKEKRQEQIAKRRRLSSLRASTSKSGGSQK (...
Ligand InfoPC cidPC sid
In DepthDetails US Patent