BDBM128497 US8796244, 76
SMILES CN1CCC(CC1)Nc1ccc(nn1)-c1ccn2c(cnc2c1)-c1cccc(NC(=O)NCC(F)(F)F)c1
InChI Key InChIKey=QXEIBRXBXUDRBY-UHFFFAOYSA-N
Data  2 IC50
  Tab Delimited (TSV)   2D SDfile   Computed 3D by Vconf -m prep SDfile
Find this compound or compounds like it in BindingDB:
Activity Spreadsheet -- Enzyme Inhibition Constant Data from BindingDB
Found 2 hits for monomerid = 128497
TargetVascular endothelial growth factor receptor 2(Homo sapiens (Human))
Astex Therapeutics
US Patent
LigandPNGBDBM128497(US8796244, 76)
Affinity DataIC50:  13nMpH: 8.0 T: 2°C. Assay description: VEGFR2 (from Upstate), prepared at 2x final concentration, was incubated with test compounds, biotinylated Flt3 substrate (biotin-VASSDNEYFYVDF) (Cel...
In DepthDetails US Patent
TargetFibroblast growth factor receptor 3(Homo sapiens (Human))
Astex Therapeutics
US Patent
LigandPNGBDBM128497(US8796244, 76)
Affinity DataIC50:  0.730nMpH: 8.0 T: 2°C. Assay description: Enzymes (from Upstate) were prepared at 2× final concentration in 1× kinase assay buffer (Table 1). Enzymes were then incubated with test compounds, ...
In DepthDetails US Patent