BDBM129006 US8802679, 261
SMILES CN(Cc1cccc(c1)-c1cnc(nc1)N1CCN(CC1)c1ccc(nc1)C#N)C(=O)CN
InChI Key InChIKey=XDABGJRXAMEIOF-UHFFFAOYSA-N
Data  2 IC50
  Tab Delimited (TSV)   2D SDfile   Computed 3D by Vconf -m prep SDfile
Find this compound or compounds like it in BindingDB:
Activity Spreadsheet -- Enzyme Inhibition Constant Data from BindingDB
Found 2 hits for monomerid = 129006
TargetMembrane primary amine oxidase(Rattus norvegicus (Rat))
Astellas Pharma
US Patent
LigandPNGBDBM129006(US8802679, 261)
Affinity DataIC50:  40nMT: 2°C. Assay description: A rat VAP-enzyme 1 (SSAO) activity was measured by a radiochemistry-enzymatic assay using 14C-benzylamine as an artificial substrate. An enzyme suspe...
In DepthDetails US Patent
TargetMembrane primary amine oxidase(Homo sapiens (Human))
Astellas Pharma
US Patent
LigandPNGBDBM129006(US8802679, 261)
Affinity DataIC50:  90nMT: 2°C. Assay description: A human VAP-1 enzyme (SSAO) activity was measured by a radiochemistry-enzymatic assay using 14C-benzylamine as an artificial substrate. An enzyme sus...
In DepthDetails US Patent