BDBM129047 US8802674, 81
SMILES COc1cc(ccc1Nc1ncc(Cl)c(NC2CCC2)n1)C(=O)N1CCOCC1
InChI Key InChIKey=VEAOUTVVLDJKJA-UHFFFAOYSA-N
Data  1 KI
  Tab Delimited (TSV)   2D SDfile   Computed 3D by Vconf -m prep SDfile
Find this compound or compounds like it in BindingDB:
Activity Spreadsheet -- Enzyme Inhibition Constant Data from BindingDB
Found 1 hit for monomerid = 129047
TargetLeucine-rich repeat serine/threonine-protein kinase 2(Homo sapiens (Human))
Genentech
US Patent
LigandPNGBDBM129047(US8802674, 81)
Affinity DataKi:  1.5nM. Assay description: This assay was used to determine a compound's potency in inhibiting activity of LRRK2 by determining, Kiapp, IC50, or percent inhibition values. ...
In DepthDetails US Patent