BDBM129283 US8815951, 544
SMILES C[C@H](NC(=O)NC1CCCCC1)c1ccccc1
InChI Key InChIKey=LAWBJZZKFIEJKK-LBPRGKRZSA-N
Data  2 IC50
  Tab Delimited (TSV)   2D SDfile   Computed 3D by Vconf -m prep SDfile
Find this compound or compounds like it in BindingDB:
Activity Spreadsheet -- Enzyme Inhibition Constant Data from BindingDB
Found 2 hits for monomerid = 129283
TargetEpoxide hydrolase 1(Homo sapiens (Human))
The Regents Of The University Of California
US Patent
LigandPNGBDBM129283(US8815951, 544)
Affinity DataIC50:  100nM. Assay description: The invention also provide methods for assaying for epoxide hydrolase activity as diagnostic assay to identify individuals at increased risk for hype...
In DepthDetails US Patent
TargetEpoxide hydrolase 1(Mus musculus (Mouse))
The Regents Of The University Of California
US Patent
LigandPNGBDBM129283(US8815951, 544)
Affinity DataIC50:  50nM. Assay description: The invention also provide methods for assaying for epoxide hydrolase activity as diagnostic assay to identify individuals at increased risk for hype...
In DepthDetails US Patent