BDBM130064 US8815918, 47
SMILES COc1cncc(c1)-c1nn2c(cnc2s1)-c1cnc(N)c(c1)C(F)(F)F
InChI Key InChIKey=UPYPASZOSPAMEB-UHFFFAOYSA-N
Data  1 IC50
  Tab Delimited (TSV)   2D SDfile   Computed 3D by Vconf -m prep SDfile
Find this compound or compounds like it in BindingDB:
Activity Spreadsheet -- Enzyme Inhibition Constant Data from BindingDB
Found 1 hit for monomerid = 130064
TargetPhosphatidylinositol 4,5-bisphosphate 3-kinase catalytic subunit alpha isoform(Homo sapiens (Human))
Centro Nacional de Investigaciones Oncologicas (CNIO)
US Patent
LigandPNGBDBM130064(US8815918, 47)
Affinity DataIC50:  21nMpH: 7.5 T: 2°C. Assay description: The kinase activity was measured by using the commercial ADP Hunter Plus assay available from DiscoveRx (#33-016), which is a homogeneous assay to me...
In DepthDetails US Patent