BDBM130351 US8822534, Example 3-26::US8993631, 3-13
SMILES CCOC(=O)CCCC(=O)N[C@@H](CC(O)=O)Cc1ccc(cc1)-c1cccc(Cl)c1
InChI Key InChIKey=OUTIJGBZTOPNCB-HXUWFJFHSA-N
Data  2 IC50
  Tab Delimited (TSV)   2D SDfile   Computed 3D by Vconf -m prep SDfile
Find this compound or compounds like it in BindingDB:
Activity Spreadsheet -- Enzyme Inhibition Constant Data from BindingDB
Found 2 hits for monomerid = 130351
TargetMembrane metallo-endopeptidase-like 1(Homo sapiens (Human))
Novartis
US Patent
LigandPNGBDBM130351(US8822534, Example 3-26 | US8993631, 3-13)
Affinity DataIC50:  15nMpH: 7.4 T: 2°C. Assay description: Recombinant human neutral endopeptidase (expressed in insect cells and purified using standard methods, final concentration 7 μM) is pre-incubat...
In DepthDetails US Patent
TargetMembrane metallo-endopeptidase-like 1(Homo sapiens (Human))
Novartis
US Patent
LigandPNGBDBM130351(US8822534, Example 3-26 | US8993631, 3-13)
Affinity DataIC50:  15nMpH: 7.4 T: 2°C. Assay description: Recombinant human neutral endopeptidase (expressed in insect cells and purified using standard methods, final concentration 7 μM) is pre-incubat...
In DepthDetails US Patent