BDBM130610 US8822447, 90
SMILES Cc1nn(-c2ccccc2)c2nc(CC3CCN(CC3)C3CNC3)[nH]c(=O)c12
InChI Key InChIKey=FFMMMFQLZAEVOO-UHFFFAOYSA-N
Data  1 IC50
  Tab Delimited (TSV)   2D SDfile   Computed 3D by Vconf -m prep SDfile
Find this compound or compounds like it in BindingDB:
Activity Spreadsheet -- Enzyme Inhibition Constant Data from BindingDB
Found 1 hit for monomerid = 130610
TargetKetohexokinase(Homo sapiens (Human))
Janssen Pharmaceutica
US Patent
LigandPNGBDBM130610(US8822447, 90)
Affinity DataIC50: >3.00E+4nMT: 2°C. Assay description: An enzymatic assay was developed to measure KHK-mediated conversion of D-fructose to Fructose-1-P (F-1-P) using High Throughput Mass Spectroscopy (HT...
In DepthDetails US Patent