BDBM130642 US8822447, 137::US9771375, Example 137
SMILES CSc1nn(-c2ccccc2)c2cc(ccc12)C(O)c1ccncc1
InChI Key InChIKey=UZUHZDRMCQQDMH-UHFFFAOYSA-N
Data  2 IC50
  Tab Delimited (TSV)   2D SDfile   Computed 3D by Vconf -m prep SDfile
Find this compound or compounds like it in BindingDB:
Activity Spreadsheet -- Enzyme Inhibition Constant Data from BindingDB
Found 2 hits for monomerid = 130642
TargetKetohexokinase(Homo sapiens (Human))
Janssen Pharmaceutica
US Patent
LigandPNGBDBM130642(US8822447, 137 | US9771375, Example 137)
Affinity DataIC50: >2.00E+3nM. Assay description: An enzymatic assay was developed to measure KHK-mediated conversion of D-fructose to Fructose-1-P (F-1-P) using High Throughput Mass Spectroscopy (HT...
In DepthDetails US Patent
TargetKetohexokinase(Homo sapiens (Human))
Janssen Pharmaceutica
US Patent
LigandPNGBDBM130642(US8822447, 137 | US9771375, Example 137)
Affinity DataIC50: >2.00E+3nMT: 2°C. Assay description: An enzymatic assay was developed to measure KHK-mediated conversion of D-fructose to Fructose-1-P (F-1-P) using High Throughput Mass Spectroscopy (HT...
In DepthDetails US Patent