BDBM130662 US8822447, 173::US9771375, Example 173
SMILES COc1ccc(cc1)-n1nc(SC)c2ccc(cc12)C(=O)c1ccc2ncn(C)c2c1
InChI Key InChIKey=WZMCBODUTXIVRP-UHFFFAOYSA-N
Data  2 IC50
  Tab Delimited (TSV)   2D SDfile   Computed 3D by Vconf -m prep SDfile
Find this compound or compounds like it in BindingDB:
Activity Spreadsheet -- Enzyme Inhibition Constant Data from BindingDB
Found 2 hits for monomerid = 130662
TargetKetohexokinase(Homo sapiens (Human))
Janssen Pharmaceutica
US Patent
LigandPNGBDBM130662(US8822447, 173 | US9771375, Example 173)
Affinity DataIC50: >1.00E+4nM. Assay description: An enzymatic assay was developed to measure KHK-mediated conversion of D-fructose to Fructose-1-P (F-1-P) using High Throughput Mass Spectroscopy (HT...
In DepthDetails US Patent
TargetKetohexokinase(Homo sapiens (Human))
Janssen Pharmaceutica
US Patent
LigandPNGBDBM130662(US8822447, 173 | US9771375, Example 173)
Affinity DataIC50: >1.00E+4nMT: 2°C. Assay description: An enzymatic assay was developed to measure KHK-mediated conversion of D-fructose to Fructose-1-P (F-1-P) using High Throughput Mass Spectroscopy (HT...
In DepthDetails US Patent