BDBM130980 US8829010, 31
SMILES CC(=O)N[C@@H]1CCN(C1)c1ncnc2n(C)nc(-c3cnn(C)c3-c3ccc(cc3)C3CC3)c12
InChI Key InChIKey=KXTQDIRPRIGFAZ-LJQANCHMSA-N
Data  1 IC50
  Tab Delimited (TSV)   2D SDfile   Computed 3D by Vconf -m prep SDfile
Find this compound or compounds like it in BindingDB:
Activity Spreadsheet -- Enzyme Inhibition Constant Data from BindingDB
Found 1 hit for monomerid = 130980
TargetcGMP-dependent 3',5'-cyclic phosphodiesterase(Homo sapiens (Human))
Pfizer
US Patent
LigandPNGBDBM130980(US8829010, 31)
Affinity DataIC50:  1.52nM. Assay description: In the present assay, the activity of the test substances on human full-length PDE2A3 enzyme was determined using the [3H]-cGMP scintillation proximi...
In DepthDetails US Patent