BDBM130985 US8829010, 36
SMILES Cn1ncc(-c2nn(C)c3ncnc(N4CC[C@@H](C4)S(C)(=O)=O)c23)c1-c1ccc(cc1)C1CC1
InChI Key InChIKey=JXGYHZBZKBMWND-SFHVURJKSA-N
Data  1 IC50
  Tab Delimited (TSV)   2D SDfile   Computed 3D by Vconf -m prep SDfile
Find this compound or compounds like it in BindingDB:
Activity Spreadsheet -- Enzyme Inhibition Constant Data from BindingDB
Found 1 hit for monomerid = 130985
TargetcGMP-dependent 3',5'-cyclic phosphodiesterase(Homo sapiens (Human))
Pfizer
US Patent
LigandPNGBDBM130985(US8829010, 36)
Affinity DataIC50:  1.43nM. Assay description: In the present assay, the activity of the test substances on human full-length PDE2A3 enzyme was determined using the [3H]-cGMP scintillation proximi...
In DepthDetails US Patent