BDBM13119 (2R)-2-[benzyl(4-methoxybenzene)sulfonamido]-N-hydroxypropanamide::CGS 27023A Analog 51::CHEMBL314064
SMILES COc1ccc(cc1)S(=O)(=O)N(Cc1ccccc1)[C@H](C)C(=O)NO
InChI Key InChIKey=JRCGNOYYZQLNTH-CYBMUJFWSA-N
Data  1 KI  1 IC50
  Tab Delimited (TSV)   2D SDfile   Computed 3D by Vconf -m prep SDfile
Find this compound or compounds like it in BindingDB:
Activity Spreadsheet -- Enzyme Inhibition Constant Data from BindingDB
Found 2 hits for monomerid = 13119
TargetStromelysin-1(Homo sapiens (Human))
Novartis Pharmaceuticals
LigandPNGBDBM13119((2R)-2-[benzyl(4-methoxybenzene)sulfonamido]-N-hyd...)
Affinity DataKi:  36nM. Assay description: Stromelysin inhibitory activity is based on the hydrolysis of substance P by recombinant human stromelysin to generate a fragment, substance P 7-11, ...
In DepthDetails ArticlePubMed
TargetMacrophage metalloelastase(Mus musculus)
Novartis Pharmaceuticals
Curated by ChEMBL
LigandPNGBDBM13119((2R)-2-[benzyl(4-methoxybenzene)sulfonamido]-N-hyd...)
Affinity DataIC50:  9.60nM. Assay description: Inhibitory activity against mouse macrophage metalloelastase (MME) using [3H]elastin as a substrate
In DepthDetails ArticlePubMed