BDBM131559 US8835472, 13.63
SMILES CC(Cc1ccc(cc1)C#Cc1cnc(N[C@@H]2CCc3ccccc23)nc1)NC(C)=O
InChI Key InChIKey=JYIIURUARNQDQQ-IXXGTQFESA-N
Data  1 IC50
  Tab Delimited (TSV)   2D SDfile   Computed 3D by Vconf -m prep SDfile
Find this compound or compounds like it in BindingDB:
Activity Spreadsheet -- Enzyme Inhibition Constant Data from BindingDB
Found 1 hit for monomerid = 131559
TargetAcetyl-CoA carboxylase 2(Homo sapiens (Human))
Boehringer Ingelheim International
US Patent
LigandPNGBDBM131559(US8835472, 13.63)
Affinity DataIC50:  200nMpH: 7.5Assay Description:Malonyl CoA formation by acetyl CoA carboxylases is stoichometrically linked to the consumption of ATP. ACC2 activity is measured in a NADH-linked ki...
In DepthDetails US Patent