BDBM13181 (2S)-2-amino-N-(5,7-dimethyl-1,8-naphthyridin-2-yl)propanamide::SMAC mimetic compound 8
SMILES C[C@H](N)C(=O)Nc1ccc2c(C)cc(C)nc2n1
InChI Key InChIKey=NEVIWLQURZYMJU-VIFPVBQESA-N
Data  1 Kd
  Tab Delimited (TSV)   2D SDfile   Computed 3D by Vconf -m prep SDfile
Find this compound or compounds like it in BindingDB:
Activity Spreadsheet -- Enzyme Inhibition Constant Data from BindingDB
Found 1 hit for monomerid = 13181
TargetE3 ubiquitin-protein ligase XIAP [241-356](Homo sapiens (Human))
Abbott Laboratories
LigandPNGBDBM13181((2S)-2-amino-N-(5,7-dimethyl-1,8-naphthyridin-2-yl...)
Affinity DataKd:  2.00E+4nMpH: 7.4 T: 2°C. Assay description: A fluorescence polarization anisotropy (FPA) competition assay was used to determine the affinities of compounds to BIR3 protein. Fluorescence polari...
In DepthDetails ArticlePubMed