BDBM13185 (2S)-2-amino-N-{5-methyl-4-[(2,4,6-trimethylphenyl)methyl]-1H-imidazol-2-yl}propanamide::SMAC mimetic compound 12
SMILES C[C@H](N)C(=O)Nc1nc(C)c(Cc2c(C)cc(C)cc2C)[nH]1
InChI Key InChIKey=HAPAZDKFFVFQSG-LBPRGKRZSA-N
Data  1 Kd
  Tab Delimited (TSV)   2D SDfile   Computed 3D by Vconf -m prep SDfile
Find this compound or compounds like it in BindingDB:
Activity Spreadsheet -- Enzyme Inhibition Constant Data from BindingDB
Found 1 hit for monomerid = 13185
TargetE3 ubiquitin-protein ligase XIAP [241-356](Homo sapiens (Human))
Abbott Laboratories
LigandPNGBDBM13185((2S)-2-amino-N-{5-methyl-4-[(2,4,6-trimethylphenyl...)
Affinity DataKd:  2.00E+3nMpH: 7.4 T: 2°C. Assay description: A fluorescence polarization anisotropy (FPA) competition assay was used to determine the affinities of compounds to BIR3 protein. Fluorescence polari...
Ligand InfoKEGGPC cidPC sid
In DepthDetails ArticlePubMed