BDBM131888 US8835436, Example 89
SMILES CCc1c(nc(-c2ccc(Cl)cc2Cl)n1-c1ccc(Br)cc1)C(=O)NCCCN1CCN(CC1)c1cccc(Cl)c1Cl
InChI Key InChIKey=SPHYMLXPNYQMAB-UHFFFAOYSA-N
Data  2 IC50
  Tab Delimited (TSV)   2D SDfile   Computed 3D by Vconf -m prep SDfile
Find this compound or compounds like it in BindingDB:
Activity Spreadsheet -- Enzyme Inhibition Constant Data from BindingDB
Found 2 hits for monomerid = 131888
Target5-hydroxytryptamine receptor 2C(Homo sapiens (Human))
Green Cross
US Patent
LigandPNGBDBM131888(US8835436, Example 89)
Affinity DataIC50:  319nMpH: 7.4Assay Description:For serotonin 5-HT2A binding, an aliquot of human recombinant serotonin 5-HT2A receptor (PerkinElmer Life and Analytical Sciences, USA) expressed in ...
In DepthDetails US Patent
Target5-hydroxytryptamine receptor 2A(Homo sapiens (Human))
Green Cross
US Patent
LigandPNGBDBM131888(US8835436, Example 89)
Affinity DataIC50:  2.32E+3nMpH: 7.4Assay Description:For serotonin 5-HT2A binding, an aliquot of human recombinant serotonin 5-HT2A receptor (PerkinElmer Life and Analytical Sciences, USA) expressed in ...
In DepthDetails US Patent