BDBM131905 US8835436, Example 148
SMILES Cc1nc(C(=O)NCC(O)CN2CCN(CC2)c2cccc(C)c2C)c(C)n1-c1ccc(C)cc1
InChI Key InChIKey=DODNFAIZJDWBTC-UHFFFAOYSA-N
Data  3 IC50
  Tab Delimited (TSV)   2D SDfile   Computed 3D by Vconf -m prep SDfile
Find this compound or compounds like it in BindingDB:
Activity Spreadsheet -- Enzyme Inhibition Constant Data from BindingDB
Found 3 hits for monomerid = 131905
Target5-hydroxytryptamine receptor 2A(Homo sapiens (Human))
Green Cross
US Patent
LigandPNGBDBM131905(US8835436, Example 148)
Affinity DataIC50:  68.2nMpH: 7.4Assay Description:For serotonin 5-HT2A binding, an aliquot of human recombinant serotonin 5-HT2A receptor (PerkinElmer Life and Analytical Sciences, USA) expressed in ...
In DepthDetails US Patent
TargetSodium-dependent serotonin transporter(Homo sapiens (Human))
Green Cross
US Patent
LigandPNGBDBM131905(US8835436, Example 148)
Affinity DataIC50:  3.89nMpH: 7.4Assay Description:For serotonin transporter binding assays, a reaction mixture with a final volume of 0.25 ml was prepared by mixing a test compound, human serotonin t...
In DepthDetails US Patent
Target5-hydroxytryptamine receptor 2C(Homo sapiens (Human))
Green Cross
US Patent
LigandPNGBDBM131905(US8835436, Example 148)
Affinity DataIC50:  705nMpH: 7.4Assay Description:For serotonin 5-HT2A binding, an aliquot of human recombinant serotonin 5-HT2A receptor (PerkinElmer Life and Analytical Sciences, USA) expressed in ...
In DepthDetails US Patent