BDBM131927 US8841455, 22
SMILES CCc1nn(Cc2cnn(c2)C2CCNC[C@H]2F)c2cccc(NC(=O)c3cnc4ccccn34)c12
InChI Key InChIKey=QIGBEHIZQCAKMK-ITUIMRKVSA-N
Data  1 IC50
  Tab Delimited (TSV)   2D SDfile   Computed 3D by Vconf -m prep SDfile
Find this compound or compounds like it in BindingDB:
Activity Spreadsheet -- Enzyme Inhibition Constant Data from BindingDB
Found 1 hit for monomerid = 131927
TargetMacrophage colony-stimulating factor 1 receptor(Homo sapiens (Human))
Array Biopharma
US Patent
LigandPNGBDBM131927(US8841455, 22)
Affinity DataIC50:  2.26E+3nMpH: 7.3 T: 2°C. Assay description: The ability of compounds of Formula I to inhibit cFMS was determined by the following assay. cFMS enzymatic activity was measured using the LANCE Ult...
In DepthDetails US Patent