BDBM13322 N-tert-Butyl-2-[[6-cyano-1-(3-methyl-3H-imidazol-4-ylmethyl)-1,2,3,4-tetrahydroquinolin-3-yl]-(1-methyl-1H-imidazole-4-sulfonyl)amino]acetamide::N-tert-butyl-2-({6-cyano-1-[(1-methyl-1H-imidazol-5-yl)methyl]-1,2,3,4-tetrahydroquinolin-3-yl}(1-methyl-1H-imidazole-4-)sulfonamido)acetamide::tetrahydroquinoline (THQ)-based inhibitor 4d
SMILES Cn1cnc(c1)S(=O)(=O)N(CC(=O)NC(C)(C)C)C1CN(Cc2cncn2C)c2ccc(cc2C1)C#N
InChI Key InChIKey=GGKUJNMJJNAMPQ-UHFFFAOYSA-N
Data  2 IC50
  Tab Delimited (TSV)   2D SDfile   Computed 3D by Vconf -m prep SDfile
Find this compound or compounds like it in BindingDB:
Activity Spreadsheet -- Enzyme Inhibition Constant Data from BindingDB
Found 2 hits for monomerid = 13322
TargetProtein farnesyltransferase/geranylgeranyltransferase type-1 subunit alpha(Rattus norvegicus (rat))
University Of Washington At Seattle
LigandPNGBDBM13322(N-tert-Butyl-2-[[6-cyano-1-(3-methyl-3H-imidazol-4...)
Affinity DataIC50:  1.5nM. Assay description: Assays for PFT activity were performed with a PFT-specific scintillation assay (SPA) kit (Amersham Biosciences, Piscataway, NJ). IC50 values were cal...
In DepthDetails ArticlePubMed
TargetATP-dependent RNA helicase RhlE(Plasmodium falciparum (malaria parasite P. falcipa...)
University Of Washington At Seattle
LigandPNGBDBM13322(N-tert-Butyl-2-[[6-cyano-1-(3-methyl-3H-imidazol-4...)
Affinity DataIC50:  1.20nMpH: 7.5 T: 2°C. Assay description: Assays for PFT activity were performed with a PFT-specific scintillation assay (SPA) kit (Amersham Biosciences, Piscataway, NJ). IC50 values were cal...
In DepthDetails ArticlePubMed