BDBM133317 US8846730, 84
SMILES CC(=O)C(C)=NOc1ccc(cc1C(=O)\N=c1/sc(cn1C[C@H]1CCCO1)C(C)(C)C)C(F)(F)F
InChI Key InChIKey=FBADXWSLVVNEBY-WRIAJGEMSA-N
Data  2 KI
  Tab Delimited (TSV)   2D SDfile   Computed 3D by Vconf -m prep SDfile
Find this compound or compounds like it in BindingDB:
Activity Spreadsheet -- Enzyme Inhibition Constant Data from BindingDB
Found 2 hits for monomerid = 133317
TargetCannabinoid receptor 2(Rattus norvegicus (Rat))
Abbvie
US Patent
LigandPNGBDBM133317(US8846730, 84)
Affinity DataKi:  2.40nM ΔG°:  -11.9kcal/molepH: 7.4 T: 2°C. Assay description: HEK293 cells stably expressing human CB2 receptors were grown until a confluent monolayer was formed. Briefly, the cells were harvested and homogeniz...
In DepthDetails US Patent
TargetCannabinoid receptor 2(Homo sapiens (Human))
Abbvie
US Patent
LigandPNGBDBM133317(US8846730, 84)
Affinity DataKi:  3.30nM ΔG°:  -11.8kcal/molepH: 7.4 T: 2°C. Assay description: HEK293 cells stably expressing human CB2 receptors were grown until a confluent monolayer was formed. Briefly, the cells were harvested and homogeniz...
In DepthDetails US Patent