BDBM13332 N-tert-Butyl-2-[[6-isocyano-1-(3-methyl-3H-imidazol-4-ylmethyl)-1,2,3,4-tetrahydroquinolin-3-yl]-(pyridine-3-sulfonyl)amino]acetamide::N-tert-butyl-2-({6-isocyano-1-[(1-methyl-1H-imidazol-5-yl)methyl]-1,2,3,4-tetrahydroquinolin-3-yl}(pyridine-3-)sulfonamido)acetamide::tetrahydroquinoline (THQ)-based inhibitor 4n
SMILES Cn1cncc1CN1CC(Cc2cc(ccc12)[N+]#[C-])N(CC(=O)NC(C)(C)C)S(=O)(=O)c1cccnc1
InChI Key InChIKey=KBFVEIDZOXSBEU-UHFFFAOYSA-N
Data  2 IC50
  Tab Delimited (TSV)   2D SDfile   Computed 3D by Vconf -m prep SDfile
Find this compound or compounds like it in BindingDB:
Activity Spreadsheet -- Enzyme Inhibition Constant Data from BindingDB
Found 2 hits for monomerid = 13332
TargetProtein farnesyltransferase/geranylgeranyltransferase type-1 subunit alpha(Rattus norvegicus (rat))
University Of Washington At Seattle
LigandPNGBDBM13332(N-tert-Butyl-2-[[6-isocyano-1-(3-methyl-3H-imidazo...)
Affinity DataIC50:  6nM. Assay description: Assays for PFT activity were performed with a PFT-specific scintillation assay (SPA) kit (Amersham Biosciences, Piscataway, NJ). IC50 values were cal...
In DepthDetails ArticlePubMed
TargetATP-dependent RNA helicase RhlE(Plasmodium falciparum (malaria parasite P. falcipa...)
University Of Washington At Seattle
LigandPNGBDBM13332(N-tert-Butyl-2-[[6-isocyano-1-(3-methyl-3H-imidazo...)
Affinity DataIC50:  25nMpH: 7.5 T: 2°C. Assay description: Assays for PFT activity were performed with a PFT-specific scintillation assay (SPA) kit (Amersham Biosciences, Piscataway, NJ). IC50 values were cal...
In DepthDetails ArticlePubMed