BDBM13338 3-(benzyloxy)pyridine::Pyridine derived fragment based inhibitor 3
SMILES C(Oc1cccnc1)c1ccccc1
InChI Key InChIKey=LLWFWIZOFFLRKC-UHFFFAOYSA-N
Data  1 IC50
  Tab Delimited (TSV)   2D SDfile   Computed 3D by Vconf -m prep SDfile
Find this compound or compounds like it in BindingDB:
Activity Spreadsheet -- Enzyme Inhibition Constant Data from BindingDB
Found 1 hit for monomerid = 13338
TargetMitogen-activated protein kinase 14(Homo sapiens (Human))
Astex
LigandPNGBDBM13338(3-(benzyloxy)pyridine | Pyridine derived fragment ...)
Affinity DataIC50:  1.00E+6nMpH: 7.4 T: 2°C. Assay description: IC50 is the inhibitor concentration, which inhibits 50% of kinase activity that catalyzes the transfer of the terminal phosphate from [gamma-33P] lab...
In DepthDetails ArticlePubMed