BDBM13339 2-Amino-3-(2,6-dichlorobenzyloxy)pyridine::3-[(2,6-dichlorophenyl)methoxy]pyridin-2-amine::Pyridine derived fragment based inhibitor 4
SMILES Nc1ncccc1OCc1c(Cl)cccc1Cl
InChI Key InChIKey=YRERGCGMZKIMTL-UHFFFAOYSA-N
Data  1 IC50
  Tab Delimited (TSV)   2D SDfile   Computed 3D by Vconf -m prep SDfile
Find this compound or compounds like it in BindingDB:
Activity Spreadsheet -- Enzyme Inhibition Constant Data from BindingDB
Found 1 hit for monomerid = 13339
TargetMitogen-activated protein kinase 14(Homo sapiens (Human))
Astex
LigandPNGBDBM13339(2-Amino-3-(2,6-dichlorobenzyloxy)pyridine | 3-[(2,...)
Affinity DataIC50:  1.09E+5nMpH: 7.4 T: 2°C. Assay description: IC50 is the inhibitor concentration, which inhibits 50% of kinase activity that catalyzes the transfer of the terminal phosphate from [gamma-33P] lab...
In DepthDetails ArticlePubMed