BDBM13342 2-({5-[(2,6-dichlorophenyl)methoxy]pyridin-2-yl}amino)-2-methylpropan-1-ol::2-[5-(2,6-Dichlorobenzyloxy)-2-pyridinylamino]-2-methyl-1-propanol::Pyridine derived fragment based inhibitor 7
SMILES CC(C)(CO)Nc1ccc(OCc2c(Cl)cccc2Cl)cn1
InChI Key InChIKey=OTWYHKXYRABIHE-UHFFFAOYSA-N
Data  1 IC50
  Tab Delimited (TSV)   2D SDfile   Computed 3D by Vconf -m prep SDfile
Find this compound or compounds like it in BindingDB:
Activity Spreadsheet -- Enzyme Inhibition Constant Data from BindingDB
Found 1 hit for monomerid = 13342
TargetMitogen-activated protein kinase 14(Homo sapiens (Human))
Astex
LigandPNGBDBM13342(2-({5-[(2,6-dichlorophenyl)methoxy]pyridin-2-yl}am...)
Affinity DataIC50:  2.40E+4nMpH: 7.4 T: 2°C. Assay description: IC50 is the inhibitor concentration, which inhibits 50% of kinase activity that catalyzes the transfer of the terminal phosphate from [gamma-33P] lab...
In DepthDetails ArticlePubMed